0
While developing source block in sandhi getting errors:

vlab@ubuntu:~/gr-DCS/build$ make
Scanning dependencies of target gnuradio-DCS
[  5%] Building CXX object lib/CMakeFiles/gnuradio-DCS.dir/ai_impl.cc.o
[ 10%] Building CXX object lib/CMakeFiles/gnuradio-DCS.dir/ai1.1_impl.cc.o
In file included from /home/vlab/gr-DCS/lib/ai1.1_impl.cc:26:0:
/home/vlab/gr-DCS/lib/ai1.1_impl.h:21:25: warning: extra tokens at end of #ifndef directive [enabled by default]
/home/vlab/gr-DCS/lib/ai1.1_impl.h:22:25: warning: missing whitespace after the macro name [enabled by default]
In file included from /home/vlab/gr-DCS/lib/ai1.1_impl.h:24:0,
                 from /home/vlab/gr-DCS/lib/ai1.1_impl.cc:26:
/home/vlab/gr-DCS/include/DCS/ai1.1.h:22:25: warning: extra tokens at end of #ifndef directive [enabled by default]
In file included from /home/vlab/gr-DCS/lib/ai1.1_impl.cc:26:0:
/home/vlab/gr-DCS/lib/ai1.1_impl.h:29:14: error: invalid suffix "_impl" on floating constant
/home/vlab/gr-DCS/lib/ai1.1_impl.h:35:10: error: invalid suffix "_impl" on floating constant
/home/vlab/gr-DCS/lib/ai1.1_impl.h:36:11: error: invalid suffix "_impl" on floating constant
/home/vlab/gr-DCS/lib/ai1.1_impl.cc:35:17: error: invalid suffix "_impl" on floating constant
/home/vlab/gr-DCS/lib/ai1.1_impl.cc:41:8: error: invalid suffix "_impl" on floating constant
/home/vlab/gr-DCS/lib/ai1.1_impl.cc:41:20: error: invalid suffix "_impl" on floating constant
/home/vlab/gr-DCS/lib/ai1.1_impl.cc:50:8: error: invalid suffix "_impl" on floating constant
/home/vlab/gr-DCS/lib/ai1.1_impl.cc:50:21: error: invalid suffix "_impl" on floating constant
/home/vlab/gr-DCS/lib/ai1.1_impl.cc:55:8: error: invalid suffix "_impl" on floating constant
In file included from /home/vlab/gr-DCS/lib/ai1.1_impl.cc:26:0:
/home/vlab/gr-DCS/lib/ai1.1_impl.h:29:14: error: expected unqualified-id before numeric constant
/home/vlab/gr-DCS/lib/ai1.1_impl.cc:31:8: error: expected unqualified-id before numeric constant
/home/vlab/gr-DCS/lib/ai1.1_impl.cc:41:8: error: expected unqualified-id before numeric constant
/home/vlab/gr-DCS/lib/ai1.1_impl.cc:50:8: error: expected unqualified-id before numeric constant
/home/vlab/gr-DCS/lib/ai1.1_impl.cc:55:8: error: expected initializer before numeric constant
/home/vlab/gr-DCS/lib/ai1.1_impl.cc:73:1: error: expected \u2018}\u2019 at end of input
/home/vlab/gr-DCS/lib/ai1.1_impl.cc:73:1: error: expected \u2018}\u2019 at end of input
make[2]: *** [lib/CMakeFiles/gnuradio-DCS.dir/ai1.1_impl.cc.o] Error 1
make[1]: *** [lib/CMakeFiles/gnuradio-DCS.dir/all] Error 2
make: *** [all] Error 2
vlab@ubuntu:~/gr-DCS/build$ make
[  5%] Building CXX object lib/CMakeFiles/gnuradio-DCS.dir/ai1.1_impl.cc.o
In file included from /home/vlab/gr-DCS/lib/ai1.1_impl.cc:26:0:
/home/vlab/gr-DCS/lib/ai1.1_impl.h:21:25: warning: extra tokens at end of #ifndef directive [enabled by default]
/home/vlab/gr-DCS/lib/ai1.1_impl.h:22:25: warning: missing whitespace after the macro name [enabled by default]
In file included from /home/vlab/gr-DCS/lib/ai1.1_impl.h:24:0,
                 from /home/vlab/gr-DCS/lib/ai1.1_impl.cc:26:
/home/vlab/gr-DCS/include/DCS/ai1.1.h:22:25: warning: extra tokens at end of #ifndef directive [enabled by default]
In file included from /home/vlab/gr-DCS/lib/ai1.1_impl.cc:26:0:
/home/vlab/gr-DCS/lib/ai1.1_impl.h:29:14: error: invalid suffix "_impl" on floating constant
/home/vlab/gr-DCS/lib/ai1.1_impl.h:35:10: error: invalid suffix "_impl" on floating constant
/home/vlab/gr-DCS/lib/ai1.1_impl.h:36:11: error: invalid suffix "_impl" on floating constant
/home/vlab/gr-DCS/lib/ai1.1_impl.cc:35:17: error: invalid suffix "_impl" on floating constant
/home/vlab/gr-DCS/lib/ai1.1_impl.cc:41:8: error: invalid suffix "_impl" on floating constant
/home/vlab/gr-DCS/lib/ai1.1_impl.cc:41:20: error: invalid suffix "_impl" on floating constant
/home/vlab/gr-DCS/lib/ai1.1_impl.cc:50:8: error: invalid suffix "_impl" on floating constant
/home/vlab/gr-DCS/lib/ai1.1_impl.cc:50:21: error: invalid suffix "_impl" on floating constant
/home/vlab/gr-DCS/lib/ai1.1_impl.cc:55:8: error: invalid suffix "_impl" on floating constant
In file included from /home/vlab/gr-DCS/lib/ai1.1_impl.cc:26:0:
/home/vlab/gr-DCS/lib/ai1.1_impl.h:29:14: error: expected unqualified-id before numeric constant
/home/vlab/gr-DCS/lib/ai1.1_impl.cc:31:8: error: expected unqualified-id before numeric constant
/home/vlab/gr-DCS/lib/ai1.1_impl.cc:41:8: error: expected unqualified-id before numeric constant
/home/vlab/gr-DCS/lib/ai1.1_impl.cc:50:8: error: expected unqualified-id before numeric constant
/home/vlab/gr-DCS/lib/ai1.1_impl.cc:55:8: error: expected initializer before numeric constant
/home/vlab/gr-DCS/lib/ai1.1_impl.cc:62:2: error: expected unqualified-id before \u2018for\u2019
/home/vlab/gr-DCS/lib/ai1.1_impl.cc:62:11: error: \u2018i\u2019 does not name a type
/home/vlab/gr-DCS/lib/ai1.1_impl.cc:62:27: error: \u2018i\u2019 does not name a type
/home/vlab/gr-DCS/lib/ai1.1_impl.cc:69:9: error: expected unqualified-id before \u2018return\u2019
/home/vlab/gr-DCS/lib/ai1.1_impl.cc:73:1: error: expected declaration before \u2018}\u2019 token
make[2]: *** [lib/CMakeFiles/gnuradio-DCS.dir/ai1.1_impl.cc.o] Error 1
make[1]: *** [lib/CMakeFiles/gnuradio-DCS.dir/all] Error 2
make: *** [all] Error 2
vlab@ubuntu:~/gr-DCS/build$ make
[  5%] Building CXX object lib/CMakeFiles/gnuradio-DCS.dir/ai1.1_impl.cc.o
In file included from /home/vlab/gr-DCS/lib/ai1.1_impl.cc:26:0:
/home/vlab/gr-DCS/lib/ai1.1_impl.h:21:25: warning: extra tokens at end of #ifndef directive [enabled by default]
/home/vlab/gr-DCS/lib/ai1.1_impl.h:22:25: warning: missing whitespace after the macro name [enabled by default]
In file included from /home/vlab/gr-DCS/lib/ai1.1_impl.h:24:0,
                 from /home/vlab/gr-DCS/lib/ai1.1_impl.cc:26:
/home/vlab/gr-DCS/include/DCS/ai1.1.h:22:25: warning: extra tokens at end of #ifndef directive [enabled by default]
In file included from /home/vlab/gr-DCS/lib/ai1.1_impl.cc:26:0:
/home/vlab/gr-DCS/lib/ai1.1_impl.h:29:14: error: invalid suffix "_impl" on floating constant
/home/vlab/gr-DCS/lib/ai1.1_impl.h:35:10: error: invalid suffix "_impl" on floating constant
/home/vlab/gr-DCS/lib/ai1.1_impl.h:36:11: error: invalid suffix "_impl" on floating constant
/home/vlab/gr-DCS/lib/ai1.1_impl.cc:35:17: error: invalid suffix "_impl" on floating constant
/home/vlab/gr-DCS/lib/ai1.1_impl.cc:41:8: error: invalid suffix "_impl" on floating constant
/home/vlab/gr-DCS/lib/ai1.1_impl.cc:41:20: error: invalid suffix "_impl" on floating constant
/home/vlab/gr-DCS/lib/ai1.1_impl.cc:50:8: error: invalid suffix "_impl" on floating constant
/home/vlab/gr-DCS/lib/ai1.1_impl.cc:50:21: error: invalid suffix "_impl" on floating constant
/home/vlab/gr-DCS/lib/ai1.1_impl.cc:55:8: error: invalid suffix "_impl" on floating constant
In file included from /home/vlab/gr-DCS/lib/ai1.1_impl.cc:26:0:
/home/vlab/gr-DCS/lib/ai1.1_impl.h:29:14: error: expected unqualified-id before numeric constant
/home/vlab/gr-DCS/lib/ai1.1_impl.cc:31:8: error: expected unqualified-id before numeric constant
/home/vlab/gr-DCS/lib/ai1.1_impl.cc:41:8: error: expected unqualified-id before numeric constant
/home/vlab/gr-DCS/lib/ai1.1_impl.cc:50:8: error: expected unqualified-id before numeric constant
/home/vlab/gr-DCS/lib/ai1.1_impl.cc:55:8: error: expected initializer before numeric constant
/home/vlab/gr-DCS/lib/ai1.1_impl.cc:62:2: error: expected unqualified-id before \u2018for\u2019
/home/vlab/gr-DCS/lib/ai1.1_impl.cc:62:15: error: \u2018i\u2019 does not name a type
/home/vlab/gr-DCS/lib/ai1.1_impl.cc:62:31: error: \u2018i\u2019 does not name a type
/home/vlab/gr-DCS/lib/ai1.1_impl.cc:69:9: error: expected unqualified-id before \u2018return\u2019
/home/vlab/gr-DCS/lib/ai1.1_impl.cc:73:1: error: expected declaration before \u2018}\u2019 token
make[2]: *** [lib/CMakeFiles/gnuradio-DCS.dir/ai1.1_impl.cc.o] Error 1
make[1]: *** [lib/CMakeFiles/gnuradio-DCS.dir/all] Error 2
make: *** [all] Error 2
vlab@ubuntu:~/gr-DCS/build$ make
[  5%] Building CXX object lib/CMakeFiles/gnuradio-DCS.dir/ai1.1_impl.cc.o
In file included from /home/vlab/gr-DCS/lib/ai1.1_impl.cc:26:0:
/home/vlab/gr-DCS/lib/ai1.1_impl.h:21:25: warning: extra tokens at end of #ifndef directive [enabled by default]
/home/vlab/gr-DCS/lib/ai1.1_impl.h:22:25: warning: missing whitespace after the macro name [enabled by default]
In file included from /home/vlab/gr-DCS/lib/ai1.1_impl.h:24:0,
                 from /home/vlab/gr-DCS/lib/ai1.1_impl.cc:26:
/home/vlab/gr-DCS/include/DCS/ai1.1.h:22:25: warning: extra tokens at end of #ifndef directive [enabled by default]
In file included from /home/vlab/gr-DCS/lib/ai1.1_impl.cc:26:0:
/home/vlab/gr-DCS/lib/ai1.1_impl.h:29:14: error: invalid suffix "_impl" on floating constant
/home/vlab/gr-DCS/lib/ai1.1_impl.h:35:10: error: invalid suffix "_impl" on floating constant
/home/vlab/gr-DCS/lib/ai1.1_impl.h:36:11: error: invalid suffix "_impl" on floating constant
/home/vlab/gr-DCS/lib/ai1.1_impl.cc:35:17: error: invalid suffix "_impl" on floating constant
/home/vlab/gr-DCS/lib/ai1.1_impl.cc:41:8: error: invalid suffix "_impl" on floating constant
/home/vlab/gr-DCS/lib/ai1.1_impl.cc:41:20: error: invalid suffix "_impl" on floating constant
/home/vlab/gr-DCS/lib/ai1.1_impl.cc:50:8: error: invalid suffix "_impl" on floating constant
/home/vlab/gr-DCS/lib/ai1.1_impl.cc:50:21: error: invalid suffix "_impl" on floating constant
/home/vlab/gr-DCS/lib/ai1.1_impl.cc:55:8: error: invalid suffix "_impl" on floating constant
In file included from /home/vlab/gr-DCS/lib/ai1.1_impl.cc:26:0:
/home/vlab/gr-DCS/lib/ai1.1_impl.h:29:14: error: expected unqualified-id before numeric constant
/home/vlab/gr-DCS/lib/ai1.1_impl.cc:31:8: error: expected unqualified-id before numeric constant
/home/vlab/gr-DCS/lib/ai1.1_impl.cc:41:8: error: expected unqualified-id before numeric constant
/home/vlab/gr-DCS/lib/ai1.1_impl.cc:50:8: error: expected unqualified-id before numeric constant
/home/vlab/gr-DCS/lib/ai1.1_impl.cc:55:8: error: expected initializer before numeric constant
/home/vlab/gr-DCS/lib/ai1.1_impl.cc:73:1: error: expected \u2018}\u2019 at end of input
/home/vlab/gr-DCS/lib/ai1.1_impl.cc:73:1: error: expected \u2018}\u2019 at end of input
make[2]: *** [lib/CMakeFiles/gnuradio-DCS.dir/ai1.1_impl.cc.o] Error 1
make[1]: *** [lib/CMakeFiles/gnuradio-DCS.dir/all] Error 2
make: *** [all] Error 2
vlab@ubuntu:~/gr-DCS/build$ make
[  5%] Building CXX object lib/CMakeFiles/gnuradio-DCS.dir/ai1.1_impl.cc.o
In file included from /home/vlab/gr-DCS/lib/ai1.1_impl.cc:26:0:
/home/vlab/gr-DCS/lib/ai1.1_impl.h:21:25: warning: extra tokens at end of #ifndef directive [enabled by default]
/home/vlab/gr-DCS/lib/ai1.1_impl.h:22:25: warning: missing whitespace after the macro name [enabled by default]
In file included from /home/vlab/gr-DCS/lib/ai1.1_impl.h:24:0,
                 from /home/vlab/gr-DCS/lib/ai1.1_impl.cc:26:
/home/vlab/gr-DCS/include/DCS/ai1.1.h:22:25: warning: extra tokens at end of #ifndef directive [enabled by default]
In file included from /home/vlab/gr-DCS/lib/ai1.1_impl.cc:26:0:
/home/vlab/gr-DCS/lib/ai1.1_impl.h:29:14: error: invalid suffix "_impl" on floating constant
/home/vlab/gr-DCS/lib/ai1.1_impl.h:35:10: error: invalid suffix "_impl" on floating constant
/home/vlab/gr-DCS/lib/ai1.1_impl.h:36:11: error: invalid suffix "_impl" on floating constant
/home/vlab/gr-DCS/lib/ai1.1_impl.cc:35:17: error: invalid suffix "_impl" on floating constant
/home/vlab/gr-DCS/lib/ai1.1_impl.cc:41:8: error: invalid suffix "_impl" on floating constant
/home/vlab/gr-DCS/lib/ai1.1_impl.cc:41:20: error: invalid suffix "_impl" on floating constant
/home/vlab/gr-DCS/lib/ai1.1_impl.cc:50:8: error: invalid suffix "_impl" on floating constant
/home/vlab/gr-DCS/lib/ai1.1_impl.cc:50:21: error: invalid suffix "_impl" on floating constant
/home/vlab/gr-DCS/lib/ai1.1_impl.cc:55:8: error: invalid suffix "_impl" on floating constant
In file included from /home/vlab/gr-DCS/lib/ai1.1_impl.cc:26:0:
/home/vlab/gr-DCS/lib/ai1.1_impl.h:29:14: error: expected unqualified-id before numeric constant
/home/vlab/gr-DCS/lib/ai1.1_impl.cc:31:8: error: expected unqualified-id before numeric constant
/home/vlab/gr-DCS/lib/ai1.1_impl.cc:41:8: error: expected unqualified-id before numeric constant
/home/vlab/gr-DCS/lib/ai1.1_impl.cc:50:8: error: expected unqualified-id before numeric constant
/home/vlab/gr-DCS/lib/ai1.1_impl.cc:55:8: error: expected initializer before numeric constant
/home/vlab/gr-DCS/lib/ai1.1_impl.cc:73:1: error: expected \u2018}\u2019 at end of input
/home/vlab/gr-DCS/lib/ai1.1_impl.cc:73:1: error: expected \u2018}\u2019 at end of input
make[2]: *** [lib/CMakeFiles/gnuradio-DCS.dir/ai1.1_impl.cc.o] Error 1
make[1]: *** [lib/CMakeFiles/gnuradio-DCS.dir/all] Error 2
make: *** [all] Error 2
vlab@ubuntu:~/gr-DCS/build$ make
[  5%] Building CXX object lib/CMakeFiles/gnuradio-DCS.dir/ai1.1_impl.cc.o
In file included from /home/vlab/gr-DCS/lib/ai1.1_impl.cc:26:0:
/home/vlab/gr-DCS/lib/ai1.1_impl.h:21:25: warning: extra tokens at end of #ifndef directive [enabled by default]
/home/vlab/gr-DCS/lib/ai1.1_impl.h:22:25: warning: missing whitespace after the macro name [enabled by default]
In file included from /home/vlab/gr-DCS/lib/ai1.1_impl.h:24:0,
                 from /home/vlab/gr-DCS/lib/ai1.1_impl.cc:26:
/home/vlab/gr-DCS/include/DCS/ai1.1.h:22:25: warning: extra tokens at end of #ifndef directive [enabled by default]
In file included from /home/vlab/gr-DCS/lib/ai1.1_impl.cc:26:0:
/home/vlab/gr-DCS/lib/ai1.1_impl.h:29:14: error: invalid suffix "_impl" on floating constant
/home/vlab/gr-DCS/lib/ai1.1_impl.h:35:10: error: invalid suffix "_impl" on floating constant
/home/vlab/gr-DCS/lib/ai1.1_impl.h:36:11: error: invalid suffix "_impl" on floating constant
/home/vlab/gr-DCS/lib/ai1.1_impl.cc:35:17: error: invalid suffix "_impl" on floating constant
/home/vlab/gr-DCS/lib/ai1.1_impl.cc:41:8: error: invalid suffix "_impl" on floating constant
/home/vlab/gr-DCS/lib/ai1.1_impl.cc:41:20: error: invalid suffix "_impl" on floating constant
/home/vlab/gr-DCS/lib/ai1.1_impl.cc:50:8: error: invalid suffix "_impl" on floating constant
/home/vlab/gr-DCS/lib/ai1.1_impl.cc:50:21: error: invalid suffix "_impl" on floating constant
/home/vlab/gr-DCS/lib/ai1.1_impl.cc:55:8: error: invalid suffix "_impl" on floating constant
In file included from /home/vlab/gr-DCS/lib/ai1.1_impl.cc:26:0:
/home/vlab/gr-DCS/lib/ai1.1_impl.h:29:14: error: expected unqualified-id before numeric constant
/home/vlab/gr-DCS/lib/ai1.1_impl.cc:31:8: error: expected unqualified-id before numeric constant
/home/vlab/gr-DCS/lib/ai1.1_impl.cc:41:8: error: expected unqualified-id before numeric constant
/home/vlab/gr-DCS/lib/ai1.1_impl.cc:50:8: error: expected unqualified-id before numeric constant
/home/vlab/gr-DCS/lib/ai1.1_impl.cc:55:8: error: expected initializer before numeric constant
/home/vlab/gr-DCS/lib/ai1.1_impl.cc:73:1: error: expected \u2018}\u2019 at end of input
/home/vlab/gr-DCS/lib/ai1.1_impl.cc:73:1: error: expected \u2018}\u2019 at end of input
make[2]: *** [lib/CMakeFiles/gnuradio-DCS.dir/ai1.1_impl.cc.o] Error 1
make[1]: *** [lib/CMakeFiles/gnuradio-DCS.dir/all] Error 2
make: *** [all] Error 2
vlab@ubuntu:~/gr-DCS/build$ make
[  5%] Building CXX object lib/CMakeFiles/gnuradio-DCS.dir/ai1.1_impl.cc.o
In file included from /home/vlab/gr-DCS/lib/ai1.1_impl.cc:26:0:
/home/vlab/gr-DCS/lib/ai1.1_impl.h:21:25: warning: extra tokens at end of #ifndef directive [enabled by default]
/home/vlab/gr-DCS/lib/ai1.1_impl.h:22:25: warning: missing whitespace after the macro name [enabled by default]
In file included from /home/vlab/gr-DCS/lib/ai1.1_impl.h:24:0,
                 from /home/vlab/gr-DCS/lib/ai1.1_impl.cc:26:
/home/vlab/gr-DCS/include/DCS/ai1.1.h:22:25: warning: extra tokens at end of #ifndef directive [enabled by default]
In file included from /home/vlab/gr-DCS/lib/ai1.1_impl.cc:26:0:
/home/vlab/gr-DCS/lib/ai1.1_impl.h:29:14: error: invalid suffix "_impl" on floating constant
/home/vlab/gr-DCS/lib/ai1.1_impl.h:35:10: error: invalid suffix "_impl" on floating constant
/home/vlab/gr-DCS/lib/ai1.1_impl.h:36:11: error: invalid suffix "_impl" on floating constant
/home/vlab/gr-DCS/lib/ai1.1_impl.cc:35:17: error: invalid suffix "_impl" on floating constant
/home/vlab/gr-DCS/lib/ai1.1_impl.cc:41:8: error: invalid suffix "_impl" on floating constant
/home/vlab/gr-DCS/lib/ai1.1_impl.cc:41:20: error: invalid suffix "_impl" on floating constant
/home/vlab/gr-DCS/lib/ai1.1_impl.cc:50:8: error: invalid suffix "_impl" on floating constant
/home/vlab/gr-DCS/lib/ai1.1_impl.cc:50:21: error: invalid suffix "_impl" on floating constant
/home/vlab/gr-DCS/lib/ai1.1_impl.cc:55:8: error: invalid suffix "_impl" on floating constant
In file included from /home/vlab/gr-DCS/lib/ai1.1_impl.cc:26:0:
/home/vlab/gr-DCS/lib/ai1.1_impl.h:29:14: error: expected unqualified-id before numeric constant
/home/vlab/gr-DCS/lib/ai1.1_impl.cc:31:8: error: expected unqualified-id before numeric constant
/home/vlab/gr-DCS/lib/ai1.1_impl.cc:41:8: error: expected unqualified-id before numeric constant
/home/vlab/gr-DCS/lib/ai1.1_impl.cc:50:8: error: expected unqualified-id before numeric constant
/home/vlab/gr-DCS/lib/ai1.1_impl.cc:55:8: error: expected initializer before numeric constant
/home/vlab/gr-DCS/lib/ai1.1_impl.cc:73:1: error: expected \u2018}\u2019 at end of input
/home/vlab/gr-DCS/lib/ai1.1_impl.cc:73:1: error: expected \u2018}\u2019 at end of input
make[2]: *** [lib/CMakeFiles/gnuradio-DCS.dir/ai1.1_impl.cc.o] Error 1
make[1]: *** [lib/CMakeFiles/gnuradio-DCS.dir/all] Error 2
make: *** [all] Error 2
vlab@ubuntu:~/gr-DCS/build$ clear

vlab@ubuntu:~/gr-DCS/build$ make
[  5%] Building CXX object lib/CMakeFiles/gnuradio-DCS.dir/ai1.1_impl.cc.o
In file included from /home/vlab/gr-DCS/lib/ai1.1_impl.cc:26:0:
/home/vlab/gr-DCS/lib/ai1.1_impl.h:21:25: warning: extra tokens at end of #ifndef directive [enabled by default]
/home/vlab/gr-DCS/lib/ai1.1_impl.h:22:25: warning: missing whitespace after the macro name [enabled by default]
In file included from /home/vlab/gr-DCS/lib/ai1.1_impl.h:24:0,
                 from /home/vlab/gr-DCS/lib/ai1.1_impl.cc:26:
/home/vlab/gr-DCS/include/DCS/ai1.1.h:22:25: warning: extra tokens at end of #ifndef directive [enabled by default]
In file included from /home/vlab/gr-DCS/lib/ai1.1_impl.cc:26:0:
/home/vlab/gr-DCS/lib/ai1.1_impl.h:29:14: error: invalid suffix "_impl" on floating constant
/home/vlab/gr-DCS/lib/ai1.1_impl.h:35:10: error: invalid suffix "_impl" on floating constant
/home/vlab/gr-DCS/lib/ai1.1_impl.h:36:11: error: invalid suffix "_impl" on floating constant
/home/vlab/gr-DCS/lib/ai1.1_impl.cc:35:17: error: invalid suffix "_impl" on floating constant
/home/vlab/gr-DCS/lib/ai1.1_impl.cc:41:8: error: invalid suffix "_impl" on floating constant
/home/vlab/gr-DCS/lib/ai1.1_impl.cc:41:20: error: invalid suffix "_impl" on floating constant
/home/vlab/gr-DCS/lib/ai1.1_impl.cc:50:8: error: invalid suffix "_impl" on floating constant
/home/vlab/gr-DCS/lib/ai1.1_impl.cc:50:21: error: invalid suffix "_impl" on floating constant
/home/vlab/gr-DCS/lib/ai1.1_impl.cc:55:8: error: invalid suffix "_impl" on floating constant
In file included from /home/vlab/gr-DCS/lib/ai1.1_impl.cc:26:0:
/home/vlab/gr-DCS/lib/ai1.1_impl.h:29:14: error: expected unqualified-id before numeric constant
/home/vlab/gr-DCS/lib/ai1.1_impl.cc:31:8: error: expected unqualified-id before numeric constant
/home/vlab/gr-DCS/lib/ai1.1_impl.cc:41:8: error: expected unqualified-id before numeric constant
/home/vlab/gr-DCS/lib/ai1.1_impl.cc:50:8: error: expected unqualified-id before numeric constant
/home/vlab/gr-DCS/lib/ai1.1_impl.cc:55:8: error: expected initializer before numeric constant
/home/vlab/gr-DCS/lib/ai1.1_impl.cc:73:1: error: expected \u2018}\u2019 at end of input
/home/vlab/gr-DCS/lib/ai1.1_impl.cc:73:1: error: expected \u2018}\u2019 at end of input
make[2]: *** [lib/CMakeFiles/gnuradio-DCS.dir/ai1.1_impl.cc.o] Error 1
make[1]: *** [lib/CMakeFiles/gnuradio-DCS.dir/all] Error 2
make: *** [all] Error 2
vlab@ubuntu:~/gr-DCS/build$


Sandhi Not Spam Edit Delete 05-08-15, 4:26 p.m. Ashwini